Reaction Details
TargetBeta-2 adrenergic receptor
LigandBDBM36014
Substrate/Competitorn/a
Ki>10000±n/a nM
CommentsPDSP_784
Citation Bylund, DBSnyder, SH Beta adrenergic receptor binding in membrane preparations from mammalian brain. Mol Pharmacol12:568-80 (1976) Beta-2 adrenergic receptor
Name:Beta-2 adrenergic receptor
Type:n/a
Mol. Mass.:46461.69
Organism:Homo sapiens (Human)
Description:P07550
Residue:413
BDBM36014
NameBDBM36014
Synonyms:(1R,2S)-(-)-ephedrine Ephedrine,(+/-) Pseudoephedrine,(+/-)
TypeGuest
Emp. Form.C10H16NO
Mol. Mass.166.2396
SMILESC[NH2+][C@@H](C)[C@H](O)c1ccccc1