Reaction Details
TargetBeta-2 adrenergic receptor
LigandBDBM81450
Substrate/Competitorn/a
Ki 0.5±n/a nM
CommentsPDSP_941
Citation Bylund, DBSnyder, SH Beta adrenergic receptor binding in membrane preparations from mammalian brain. Mol Pharmacol12:568-80 (1976) Beta-2 adrenergic receptor
Name:Beta-2 adrenergic receptor
Type:n/a
Mol. Mass.:46461.69
Organism:Homo sapiens (Human)
Description:P07550
Residue:413
BDBM81450
NameBDBM81450
Synonyms:CAS_112184 NSC_112184
TypeSmall organic molecule
Emp. Form.C21H26N2O3
Mol. Mass.354.4427
SMILESCC(C)(Cc1ccc(O)cc1)NCC(O)COc1cccc2[nH]ccc12