Reaction Details
TargetBeta-2 adrenergic receptor
LigandBDBM50326545
Substrate/Competitorn/a
Ki 460±n/a nM
CommentsPDSP_1239
Citation Bylund, DBSnyder, SH Beta adrenergic receptor binding in membrane preparations from mammalian brain. Mol Pharmacol12:568-80 (1976) Beta-2 adrenergic receptor
Name:Beta-2 adrenergic receptor
Type:n/a
Mol. Mass.:46461.69
Organism:Homo sapiens (Human)
Description:P07550
Residue:413
BDBM50326545
NameBDBM50326545
Synonyms:CHEMBL1243407 Zinterol
TypeSmall organic molecule
Emp. Form.C19H26N2O4S
Mol. Mass.378.486
SMILESCC(C)(Cc1ccccc1)NCC(O)c1ccc(O)c(NS(C)(=O)=O)c1