Reaction Details
TargetAlpha-1A adrenergic receptor
LigandBDBM86698
Substrate/Competitorn/a
Ki 47±n/a nM
CommentsPDSP_20584
Citation U'Prichard, DCGreenberg, DASnyder, SH Binding characteristics of a radiolabeled agonist and antagonist at central nervous system alpha noradrenergic receptors. Mol Pharmacol13:454-73 (1977) Alpha-1A adrenergic receptor
Name:Alpha-1A adrenergic receptor
Type:Protein
Mol. Mass.:51620.15
Organism:Rattus norvegicus (Rat)
Description:P43140
Residue:466
BDBM86698
NameBDBM86698
Synonyms:BENZTROPINE CHEMBL116590 | NSC_2344
TypeSmall organic molecule
Emp. Form.C21H25NO
Mol. Mass.307.4293
SMILESCN1C2CCC1CC(C2)OC(c1ccccc1)c1ccccc1