Reaction Details
TargetAlpha-1A adrenergic receptor
LigandBDBM81458
Substrate/Competitorn/a
Ki>60000±n/a nM
CommentsPDSP_20551
Citation U'Prichard, DCGreenberg, DASnyder, SH Binding characteristics of a radiolabeled agonist and antagonist at central nervous system alpha noradrenergic receptors. Mol Pharmacol13:454-73 (1977) Alpha-1A adrenergic receptor
Name:Alpha-1A adrenergic receptor
Type:Protein
Mol. Mass.:51620.15
Organism:Rattus norvegicus (Rat)
Description:P43140
Residue:466
BDBM81458
NameBDBM81458
Synonyms:CAS_57-94-3 d-Tubocurarine
TypeSmall organic molecule
Emp. Form.C37H41N2O6
Mol. Mass.609.7307
SMILESCOc1cc2CC[N+](C)(C)C3Cc4ccc(O)c(Oc5cc6C(Cc7ccc(Oc(c1O)c23)cc7)N(C)CCc6cc5OC)c4