Reaction Details
TargetAlpha-1A adrenergic receptor
LigandBDBM81457
Substrate/Competitorn/a
Ki 100±n/a nM
CommentsPDSP_20641
Citation U'Prichard, DCGreenberg, DASnyder, SH Binding characteristics of a radiolabeled agonist and antagonist at central nervous system alpha noradrenergic receptors. Mol Pharmacol13:454-73 (1977) Alpha-1A adrenergic receptor
Name:Alpha-1A adrenergic receptor
Type:Protein
Mol. Mass.:51620.15
Organism:Rattus norvegicus (Rat)
Description:P43140
Residue:466
BDBM81457
NameBDBM81457
Synonyms:CAS_7762-32-5 NSC_94342
TypeSmall organic molecule
Emp. Form.C22H26N2O4
Mol. Mass.382.4528
SMILESC(C1COc2ccccc2O1)N1CCN(CC2COc3ccccc3O2)CC1