Reaction Details
TargetAlpha-1A adrenergic receptor
LigandBDBM81446
Substrate/Competitorn/a
Ki 1400±n/a nM
CommentsPDSP_20651
Citation U'Prichard, DCGreenberg, DASnyder, SH Binding characteristics of a radiolabeled agonist and antagonist at central nervous system alpha noradrenergic receptors. Mol Pharmacol13:454-73 (1977) Alpha-1A adrenergic receptor
Name:Alpha-1A adrenergic receptor
Type:Protein
Mol. Mass.:51620.15
Organism:Rattus norvegicus (Rat)
Description:P43140
Residue:466
BDBM81446
NameBDBM81446
Synonyms:CAS_60-79-7 NSC_104873
TypeSmall organic molecule
Emp. Form.C19H23N3O2
Mol. Mass.325.4048
SMILESCC(CO)NC(=O)C1CN(C)C2Cc3c[nH]c4cccc(C2=C1)c34