Reaction Details
TargetAlpha-1A adrenergic receptor
LigandBDBM162127
Substrate/Competitorn/a
Ki 17±n/a nM
CommentsPDSP_20679
Citation U'Prichard, DCGreenberg, DASnyder, SH Binding characteristics of a radiolabeled agonist and antagonist at central nervous system alpha noradrenergic receptors. Mol Pharmacol13:454-73 (1977) Alpha-1A adrenergic receptor
Name:Alpha-1A adrenergic receptor
Type:Protein
Mol. Mass.:51620.15
Organism:Rattus norvegicus (Rat)
Description:P43140
Residue:466
BDBM162127
NameBDBM162127
Synonyms:(+)-noradrenaline (S)-noradrenaline | (S)-norepinephrine
Typen/a
Emp. Form.C8H11NO3
Mol. Mass.169.1778
SMILESNC[C@@H](O)c1ccc(O)c(O)c1