Reaction Details
TargetAlpha-1A adrenergic receptor
LigandBDBM10758
Substrate/Competitorn/a
Ki 2100±n/a nM
CommentsPDSP_20666
Citation U'Prichard, DCGreenberg, DASnyder, SH Binding characteristics of a radiolabeled agonist and antagonist at central nervous system alpha noradrenergic receptors. Mol Pharmacol13:454-73 (1977) Alpha-1A adrenergic receptor
Name:Alpha-1A adrenergic receptor
Type:Protein
Mol. Mass.:51620.15
Organism:Rattus norvegicus (Rat)
Description:P43140
Residue:466
BDBM10758
NameBDBM10758
Synonyms:14C-phenylethylamine CHEMBL610 | phenylethylamine
TypeSmall organic molecule
Emp. Form.C8H11N
Mol. Mass.121.1796
SMILESNCCc1ccccc1