Reaction Details
TargetAlpha-1A adrenergic receptor
LigandBDBM30703
Substrate/Competitorn/a
Ki 4.8±n/a nM
CommentsPDSP_20578
Citation U'Prichard, DCGreenberg, DASnyder, SH Binding characteristics of a radiolabeled agonist and antagonist at central nervous system alpha noradrenergic receptors. Mol Pharmacol13:454-73 (1977) Alpha-1A adrenergic receptor
Name:Alpha-1A adrenergic receptor
Type:Protein
Mol. Mass.:51620.15
Organism:Rattus norvegicus (Rat)
Description:P43140
Residue:466
BDBM30703
NameBDBM30703
Synonyms:2-(4-tert-butyl-2,6-dimethyl-benzyl)-2-imidazoline;hydrochloride 2-[(4-tert-butyl-2,6-dimethylphenyl)methyl]-4,5-dihydro-1H-imidazole;hydrochloride MLS000069695 XYLOMETAZOLINE HYDROCHLORIDE cid_5282386
TypeSmall organic molecule
Emp. Form.C16H24N2
Mol. Mass.244.3752
SMILESCc1cc(cc(C)c1CC1=NCCN1)C(C)(C)C