Reaction Details
Target5-hydroxytryptamine receptor 7
LigandBDBM84342
Substrate/Competitorn/a
Ki 600±n/a nM
CommentsPDSP_238
Citation Greengrass, PBremner, R Binding characteristics of 3H-prazosin to rat brain alpha-adrenergic receptors. Eur J Pharmacol55:323-6 (1979) 
 
5-hydroxytryptamine receptor 7
Name:5-hydroxytryptamine receptor 7
Type:G Protein-Coupled Receptor (GPCR)
Mol. Mass.:49852.62
Organism:Rattus norvegicus (rat)
Description:Rat cloned 5-HT7R.
Residue:448
BDBM84342
NameBDBM84342
Synonyms:4-[1-hydroxy-2-(methylamino)ethyl]benzene-1,2-diol 4-[1-hydroxy-2-(methylamino)ethyl]benzene-1,2-diol;hydrochloride 4-[2-(methylamino)-1-oxidanyl-ethyl]benzene-1,2-diol;hydrochloride EPINEPHRINE MLS001333244 cid_5924
TypeSmall organic molecule
Emp. Form.C9H13NO3
Mol. Mass.183.2044
SMILESCNCC(O)c1ccc(O)c(O)c1