Reaction Details
TargetHistamine H1 receptor
LigandBDBM22883
Substrate/Competitorn/a
Ki>10000±n/a nM
CommentsPDSP_671
Citation Tran, VTChang, RSSnyder, SH Histamine H1 receptors identified in mammalian brain membranes with [3H]mepyramine. Proc Natl Acad Sci U S A75:6290-4 (1978) 
 
Histamine H1 receptor
Name:Histamine H1 receptor
Type:Enzyme Catalytic Domain
Mol. Mass.:55716.35
Organism:RAT
Description:HISTAMINE H1 HRH1 RAT::P31390
Residue:486
BDBM22883
NameBDBM22883
Synonyms:CHEMBL12344 [3-(carbamimidoylsulfanyl)propyl]dimethylamine
TypeSmall organic molecule
Emp. Form.C6H15N3S
Mol. Mass.161.268
SMILESCN(C)CCCSC(N)=N