Reaction Details
TargetHistamine H1 receptor
LigandBDBM22567
Substrate/Competitorn/a
Ki 4.5±n/a nM
CommentsPDSP_1202
Citation Tran, VTChang, RSSnyder, SH Histamine H1 receptors identified in mammalian brain membranes with [3H]mepyramine. Proc Natl Acad Sci U S A75:6290-4 (1978) 
 
Histamine H1 receptor
Name:Histamine H1 receptor
Type:Enzyme Catalytic Domain
Mol. Mass.:55716.35
Organism:RAT
Description:HISTAMINE H1 HRH1 RAT::P31390
Residue:486
BDBM22567
NameBDBM22567
Synonyms:3H]pyrilamine Dorantamin N-(4-methoxybenzyl)-N ,N -dimethyl-N-pyridin-2-ylethane-1,2-diamine PYRILAMINE [3H]mepyramine | [3H]pyrilamine
Typeradiolabeled ligand
Emp. Form.C17H23N3O
Mol. Mass.285.384
SMILESCOc1ccc(CN(CCN(C)C)c2ccccn2)cc1