Reaction Details
TargetGamma-aminobutyric acid type B receptor subunit 1
LigandBDBM50000693
Substrate/Competitorn/a
Ki 6200±n/a nM
CommentsPDSP_367
Citation Williams, MRisley, EA Characterization of the binding of [3H]muscimol, a potent gamma-aminobutyric acid agonist, to rat brain synaptosomal membranes using a filtration assay. J Neurochem32:713-8 (1979) 
 
Gamma-aminobutyric acid type B receptor subunit 1
Name:Gamma-aminobutyric acid type B receptor subunit 1
Type:Enzyme Catalytic Domain
Mol. Mass.:111548.69
Organism:Rattus norvegicus (Rat)
Description:Q9Z0U4
Residue:991
BDBM50000693
NameBDBM50000693
Synonyms:(R)-6-((S)-6-Methyl-5,6,7,8-tetrahydro-[1,3]dioxolo[4,5-g]isoquinolin-5-yl)-6H-furo[3',4':3,4]benzo[1,2-d][1,3]dioxol-8-one (bicuculline) 6-Methyl-5-(8-oxo-6,8-dihydro-furo[3',4':3,4]benzo[1,2-d][1,3]dioxol-6-yl)-5,6,7,8-tetrahydro-[1,3]dioxolo[4,5-g]isoquinolin-6-ium 6-(6-Methyl-5,6,7,8-tetrahydro-[1,3]dioxolo[4,5-g]isoquinolin-5-yl)-6H-furo[3',4':3,4]benzo[1,2-d][1,3]dioxol-8-one (Bicuculline) Bicuculline,(+) bicuculline
TypeSmall organic molecule
Emp. Form.C20H17NO6
Mol. Mass.367.3521
SMILESCN1CCc2cc3OCOc3cc2[C@H]1[C@@H]1OC(=O)c2c1ccc1OCOc21