Reaction Details
TargetGamma-aminobutyric acid type B receptor subunit 1
LigandBDBM23183
Substrate/Competitorn/a
Ki 10±n/a nM
CommentsPDSP_1260
Citation Williams, MRisley, EA Characterization of the binding of [3H]muscimol, a potent gamma-aminobutyric acid agonist, to rat brain synaptosomal membranes using a filtration assay. J Neurochem32:713-8 (1979) 
 
Gamma-aminobutyric acid type B receptor subunit 1
Name:Gamma-aminobutyric acid type B receptor subunit 1
Type:Enzyme Catalytic Domain
Mol. Mass.:111548.69
Organism:Rattus norvegicus (Rat)
Description:Q9Z0U4
Residue:991
BDBM23183
NameBDBM23183
Synonyms:5-(aminomethyl)-1,2-oxazol-3-ol CHEMBL273481 Pantherine
TypeGABA Agonist
Emp. Form.C4H6N2O2
Mol. Mass.114.1026
SMILESNCc1cc(=O)[nH]o1