Reaction Details
TargetD(2) dopamine receptor
LigandBDBM30709
Substrate/Competitorn/a
Ki 0.7±n/a nM
CommentsPDSP_2787
Citation Burt, DRCreese, ISnyder, SH Properties of [3H]haloperidol and [3H]dopamine binding associated with dopamine receptors in calf brain membranes. Mol Pharmacol12:800-12 (1976) D(2) dopamine receptor
Name:D(2) dopamine receptor
Type:Enzyme Catalytic Domain
Mol. Mass.:50698.79
Organism:BOVINE
Description:P20288
Residue:444
BDBM30709
NameBDBM30709
Synonyms:ERGOCORNINE SMR000058938 | cid_73453
TypeSmall organic molecule
Emp. Form.C31H39N5O5
Mol. Mass.561.6719
SMILES[H][C@@]12CCCN1C(=O)[C@H](C(C)C)N1C(=O)[C@](NC(=O)[C@H]3CN(C)[C@]4([H])Cc5c[nH]c6cccc(C4=C3)c56)(O[C@@]21O)C(C)C