Reaction Details
TargetD(2) dopamine receptor
LigandBDBM78433
Substrate/Competitorn/a
Ki 0.8±n/a nM
CommentsPDSP_837
Citation Burt, DRCreese, ISnyder, SH Properties of [3H]haloperidol and [3H]dopamine binding associated with dopamine receptors in calf brain membranes. Mol Pharmacol12:800-12 (1976) D(2) dopamine receptor
Name:D(2) dopamine receptor
Type:Enzyme Catalytic Domain
Mol. Mass.:50698.79
Organism:BOVINE
Description:P20288
Residue:444
BDBM78433
NameBDBM78433
Synonyms:2-[4-[3-[2-(trifluoromethyl)-10-phenothiazinyl]propyl]-1-piperazinyl]ethanol;hydrochloride 2-[4-[3-[2-(trifluoromethyl)phenothiazin-10-yl]propyl]piperazino]ethanol;hydrochloride FLUPHENAZINE HYDROCHLORIDE SMR000058411 cid_6602611 | med.21724, Compound 17
TypeSmall organic molecule
Emp. Form.C22H26F3N3OS
Mol. Mass.437.522
SMILESOCCN1CCN(CCCN2c3ccccc3Sc3ccc(cc23)C(F)(F)F)CC1