Reaction Details
TargetMuscarinic acetylcholine receptor M1
LigandBDBM50006584
Substrate/Competitorn/a
Ki 9100±n/a nM
CommentsPDSP_1167
Citation Wei, HBRoeske, WRLai, JWanibuchi, FHidaka, KUsuda, SYamamura, HI Pharmacological characterization of a novel muscarinic partial agonist, YM796, in transfected cells expressing the m1 or m2 muscarinic receptor gene. Life Sci50:355-63 (1992) 
 
Muscarinic acetylcholine receptor M1
Name:Muscarinic acetylcholine receptor M1
Type:Enzyme Catalytic Domain
Mol. Mass.:51390.46
Organism:RAT
Description:P08482
Residue:460
BDBM50006584
NameBDBM50006584
Synonyms:(McN-A-343) [4-(3-Chloro-phenylcarbamoyloxy)-but-2-ynyl]-trimethyl-ammonium; chloride 4-(3-chlorophenylcarbamoyloxy)-N,N,N-trimethylbut-2-yn-1-aminium CHEMBL40554 McN-A-343 [4-(3-Chloro-phenylcarbamoyloxy)-but-2-ynyl]-trimethyl-ammonium; chloride (McN-A-343)
TypeSmall organic molecule
Emp. Form.C14H18ClN2O2
Mol. Mass.281.757
SMILESC[N+](C)(C)CC#CCOC(=O)Nc1cccc(Cl)c1