Reaction Details
Target5-hydroxytryptamine receptor 3A
LigandBDBM50007871
Substrate/Competitorn/a
Ki 2.8±n/a nM
CommentsPDSP_1919
Citation Dumuis, AGozlan, HSebben, MAnsanay, HRizzi, CATurconi, MMonferini, EGiraldo, ESchiantarelli, PLadinsky, H Characterization of a novel 5-HT4 receptor antagonist of the azabicycloalkyl benzimidazolone class: DAU 6285. Naunyn Schmiedebergs Arch Pharmacol345:264-9 (1992) 
 
5-hydroxytryptamine receptor 3A
Name:5-hydroxytryptamine receptor 3A
Type:Enzyme Catalytic Domain
Mol. Mass.:55428.70
Organism:RAT
Description:5-HT3 HTR3A RAT::P35563
Residue:483
BDBM50007871
NameBDBM50007871
Synonyms:CHEMBL8197 TROPISETRON
TypeSmall organic molecule
Emp. Form.C17H20N2O2
Mol. Mass.284.3529
SMILESCN1C2CCC1CC(C2)OC(=O)c1c[nH]c2ccccc12