Reaction Details
TargetSentrin-specific protease 1
LigandBDBM81512
Substrate/Competitorn/a
Meas. Tech.Fluorogenic Assay
pH8±0
Temperature310.15±0 K
IC50 3.25e+4± 2.8e+3 nM
Citation Albrow, VEPonder, ELFasci, DBékés, MDeu, ESalvesen, GSBogyo, M Development of small molecule inhibitors and probes of human SUMO deconjugating proteases. Chem Biol18:722-32 (2011) 
 
Sentrin-specific protease 1
Name:Sentrin-specific protease 1
Type:Protein
Mol. Mass.:73500.42
Organism:Homo sapiens (Human)
Description:Q9P0U3
Residue:644
BDBM81512
NameBDBM81512
Synonyms:VEA-417
TypeSmall organic molecule
Emp. Form.C36H31N5O6
Mol. Mass.629.6612
SMILESNC(=O)CNC(=O)c1ccc(cc1)C(=O)NNC(=O)[C@H]1O[C@@H]1C(=O)N(Cc1cccc2ccccc12)Cc1cccc2ccccc12