Reaction Details
TargetSentrin-specific protease 6
LigandBDBM81515
Substrate/Competitorn/a
Meas. Tech.Fluorogenic Assay
pH8±0
Temperature310.15±0 K
IC50>6.0e+4±n/a nM
Citation Albrow, VEPonder, ELFasci, DBékés, MDeu, ESalvesen, GSBogyo, M Development of small molecule inhibitors and probes of human SUMO deconjugating proteases. Chem Biol18:722-32 (2011) 
 
Sentrin-specific protease 6
Name:Sentrin-specific protease 6
Type:Enzyme Catalytic Domain
Mol. Mass.:126147.68
Organism:Homo sapiens (Human)
Description:Q9GZR1
Residue:1112
BDBM81515
NameBDBM81515
Synonyms:VEA-499
TypeSmall organic molecule
Emp. Form.C37H38N6O12
Mol. Mass.758.7306
SMILESC[C@H](O)C(NC(=O)[C@H](CCC(N)=O)NC(=O)Cc1ccc(O)c(c1)N(=O)=O)C(=O)NCC(=O)NCC(=O)COC(=O)c1c2ccccc2cc2ccccc12