Reaction Details
TargetHistamine H2 receptor
LigandBDBM22904
Substrate/Competitorn/a
Ki 1±n/a nM
CommentsPDSP_272
Citation Hill, SJ Multiple histamine receptors: properties and functional characteristics. Biochem Soc Trans20:122-5 (1992) 
 
Histamine H2 receptor
Name:Histamine H2 receptor
Type:G Protein-Coupled Receptor (GPCR)
Mol. Mass.:40567.22
Organism:Cavia porcellus (domestic guinea pig)
Description:For the H2 receptor-binding assays, guinea pig striatum was used.
Residue:359
BDBM22904
NameBDBM22904
Synonyms:(2R)-1-(1H-imidazol-5-yl)propan-2-amine Alpha-Methylhistamine-R CHEMBL268229 RAMH
TypeSmall organic molecule
Emp. Form.C6H11N3
Mol. Mass.125.1716
SMILESC[C@@H](N)Cc1cnc[nH]1