Reaction Details
TargetMitogen-activated protein kinase 7
LigandBDBM50337134
Substrate/Competitorn/a
Meas. Tech.Biochemical Assay
Kd 80±0.0 nM
Citation Miduturu, CVDeng, XKwiatkowski, NYang, WBrault, LFilippakopoulos, PChung, EYang, QSchwaller, JKnapp, SKing, RWLee, JDHerrgard, SZarrinkar, PGray, NS High-throughput kinase profiling: a more efficient approach toward the discovery of new kinase inhibitors. Chem Biol18:868-79 (2011) 
 
Mitogen-activated protein kinase 7
Name:Mitogen-activated protein kinase 7
Type:Protein
Mol. Mass.:88377.36
Organism:Homo sapiens (Human)
Description:Q13164
Residue:816
BDBM50337134
NameBDBM50337134
Synonyms:2-((2-ethoxy-4-(4-hydroxypiperidin-1-yl)phenyl)amino)-5,11-dimethyl-5H-benzo[e]pyrimido[5,4-b][1,4]diazepin-6(11H)-one Scaffold, B46 | US9266890, IV-6
TypeSmall organic molecule
Emp. Form.C26H30N6O3
Mol. Mass.474.5548
SMILESCCOc1cc(ccc1Nc1ncc2N(C)C(=O)c3ccccc3N(C)c2n1)N1CCC(O)CC1