Reaction Details
TargetAurora kinase C
LigandBDBM81552
Substrate/Competitorn/a
Meas. Tech.Biochemical Assay
IC50 41±0.0 nM
Citation Miduturu, CVDeng, XKwiatkowski, NYang, WBrault, LFilippakopoulos, PChung, EYang, QSchwaller, JKnapp, SKing, RWLee, JDHerrgard, SZarrinkar, PGray, NS High-throughput kinase profiling: a more efficient approach toward the discovery of new kinase inhibitors. Chem Biol18:868-79 (2011) 
 
Aurora kinase C
Name:Aurora kinase C
Type:Enzyme
Mol. Mass.:35602.43
Organism:Homo sapiens (Human)
Description:Amino acid residues 1-309 were expressed as His-tagged fusion protein using baculovirus expression system.
Residue:309
BDBM81552
NameBDBM81552
Synonyms:Benzo[e]pyrimido[5,4-b][1,4]diazepin-6(11H)-one, 1 | Scaffold, B54
TypeSmall organic molecule
Emp. Form.C24H26N6O2
Mol. Mass.430.5022
SMILESCN1c2ccccc2C(=O)N(C)c2cnc(Nc3ccc(cc3)N3CCC(O)CC3)nc12