Reaction Details
TargetCannabinoid receptor 2
LigandBDBM81556
Substrate/Competitorn/a
Meas. Tech.Binding Assay
Ki 278±17 nM
Citation Schuehly, WParedes, JMKleyer, JHuefner, AAnavi-Goffer, SRaduner, SAltmann, KHGertsch, J Mechanisms of Osteoclastogenesis Inhibition by a Novel Class of Biphenyl-Type Cannabinoid CB(2) Receptor Inverse Agonists. Chem Biol18:1053-64 (2011) 
 
Cannabinoid receptor 2
Name:Cannabinoid receptor 2
Type:G Protein-Coupled Receptor (GPCR)
Mol. Mass.:39690.94
Organism:Homo sapiens (Human)
Description:P34972
Residue:360
BDBM81556
NameBDBM81556
Synonyms:Arachidonoylethanolamide, AEA
TypeSmall organic molecule
Emp. Form.C22H37NO2
Mol. Mass.347.5347
SMILESCCCCC\C=C\C\C=C\C\C=C\C\C=C\CCCC(=O)NCCO