Reaction Details
TargetCannabinoid receptor 2
LigandBDBM50295926
Substrate/Competitorn/a
Meas. Tech.Binding Assay
Ki 43.9±5 nM
Citation Schuehly, WParedes, JMKleyer, JHuefner, AAnavi-Goffer, SRaduner, SAltmann, KHGertsch, J Mechanisms of Osteoclastogenesis Inhibition by a Novel Class of Biphenyl-Type Cannabinoid CB(2) Receptor Inverse Agonists. Chem Biol18:1053-64 (2011) 
 
Cannabinoid receptor 2
Name:Cannabinoid receptor 2
Type:G Protein-Coupled Receptor (GPCR)
Mol. Mass.:39690.94
Organism:Homo sapiens (Human)
Description:P34972
Residue:360
BDBM50295926
NameBDBM50295926
Synonyms:4'-O-methylhonokiol, MH 5,3'-Diallyl-4'-methoxy-biphenyl-2-ol Magreth-14a | Methylhonokiol
TypeSmall organic molecule
Emp. Form.C19H20O2
Mol. Mass.280.3609
SMILESCOc1ccc(cc1CC=C)-c1cc(CC=C)ccc1O