Reaction Details
TargetCannabinoid receptor 2
LigandBDBM81560
Substrate/Competitorn/a
Meas. Tech.Binding Assay
Ki 427±21 nM
Citation Schuehly, WParedes, JMKleyer, JHuefner, AAnavi-Goffer, SRaduner, SAltmann, KHGertsch, J Mechanisms of Osteoclastogenesis Inhibition by a Novel Class of Biphenyl-Type Cannabinoid CB(2) Receptor Inverse Agonists. Chem Biol18:1053-64 (2011) 
 
Cannabinoid receptor 2
Name:Cannabinoid receptor 2
Type:G Protein-Coupled Receptor (GPCR)
Mol. Mass.:39690.94
Organism:Homo sapiens (Human)
Description:P34972
Residue:360
BDBM81560
NameBDBM81560
Synonyms:Magreth-11c
TypeSmall organic molecule
Emp. Form.C19H22Br2O2
Mol. Mass.442.185
SMILESCOc1ccc(cc1CC(C)Br)-c1cc(CC(C)Br)ccc1O