Reaction Details
TargetCannabinoid receptor 2
LigandBDBM81567
Substrate/Competitorn/a
Meas. Tech.Binding Assay
Ki 102±4 nM
Citation Schuehly, WParedes, JMKleyer, JHuefner, AAnavi-Goffer, SRaduner, SAltmann, KHGertsch, J Mechanisms of Osteoclastogenesis Inhibition by a Novel Class of Biphenyl-Type Cannabinoid CB(2) Receptor Inverse Agonists. Chem Biol18:1053-64 (2011) 
 
Cannabinoid receptor 2
Name:Cannabinoid receptor 2
Type:G Protein-Coupled Receptor (GPCR)
Mol. Mass.:39690.94
Organism:Homo sapiens (Human)
Description:P34972
Residue:360
BDBM81567
NameBDBM81567
Synonyms:Magreth-18a
TypeSmall organic molecule
Emp. Form.C23H28O2
Mol. Mass.336.4672
SMILESCCCCCOc1ccc(CC=C)cc1-c1ccc(O)c(CC=C)c1