Reaction Details
TargetCannabinoid receptor 1
LigandBDBM50295920
Substrate/Competitorn/a
Meas. Tech.Binding Assay
Ki>2000±0 nM
Citation Schuehly, WParedes, JMKleyer, JHuefner, AAnavi-Goffer, SRaduner, SAltmann, KHGertsch, J Mechanisms of Osteoclastogenesis Inhibition by a Novel Class of Biphenyl-Type Cannabinoid CB(2) Receptor Inverse Agonists. Chem Biol18:1053-64 (2011) 
 
Cannabinoid receptor 1
Name:Cannabinoid receptor 1
Type:G Protein-Coupled Receptor (GPCR)
Mol. Mass.:52868.96
Organism:Homo sapiens (Human)
Description:P21554
Residue:472
BDBM50295920
NameBDBM50295920
Synonyms:4'-Methoxy-5,3'-dipropyl-biphenyl-2ol Magreth-1
TypeSmall organic molecule
Emp. Form.C19H24O2
Mol. Mass.284.3927
SMILESCCCc1ccc(O)c(c1)-c1ccc(OC)c(CCC)c1