Reaction Details
TargetCannabinoid receptor 1
LigandBDBM81569
Substrate/Competitorn/a
Meas. Tech.Binding Assay
Ki>3000±0 nM
Citation Schuehly, WParedes, JMKleyer, JHuefner, AAnavi-Goffer, SRaduner, SAltmann, KHGertsch, J Mechanisms of Osteoclastogenesis Inhibition by a Novel Class of Biphenyl-Type Cannabinoid CB(2) Receptor Inverse Agonists. Chem Biol18:1053-64 (2011) 
 
Cannabinoid receptor 1
Name:Cannabinoid receptor 1
Type:G Protein-Coupled Receptor (GPCR)
Mol. Mass.:52868.96
Organism:Homo sapiens (Human)
Description:P21554
Residue:472
BDBM81569
NameBDBM81569
Synonyms:Magreth-19
TypeSmall organic molecule
Emp. Form.C22H26O2
Mol. Mass.322.4406
SMILESCCOc1ccc(cc1CC=C)-c1cc(CC=C)ccc1OCC