Reaction Details
TargetCannabinoid receptor 2
LigandBDBM50157304
Substrate/Competitorn/a
Meas. Tech.Binding Assay
Ki 1763±0.0 nM
Citation Schuehly, WParedes, JMKleyer, JHuefner, AAnavi-Goffer, SRaduner, SAltmann, KHGertsch, J Mechanisms of Osteoclastogenesis Inhibition by a Novel Class of Biphenyl-Type Cannabinoid CB(2) Receptor Inverse Agonists. Chem Biol18:1053-64 (2011) 
 
Cannabinoid receptor 2
Name:Cannabinoid receptor 2
Type:G Protein-Coupled Receptor (GPCR)
Mol. Mass.:39690.94
Organism:Homo sapiens (Human)
Description:P34972
Residue:360
BDBM50157304
NameBDBM50157304
Synonyms:3',5-di-2-propenyl-1,1'-biphenyl-2,4'-diol 5,3''-Diallyl-biphenyl-2,4''-diol CHEMBL16901 Honokiol, HO | cid_72303
TypeSmall organic molecule
Emp. Form.C18H18O2
Mol. Mass.266.3343
SMILESOc1ccc(cc1CC=C)-c1cc(CC=C)ccc1O