Reaction Details
Targetp53 binding protein
LigandBDBM81632
Substrate/Competitorn/a
Meas. Tech.HDM2 Binding Assay
IC50 1.0e+3±n/a nM
Citation Cummings, MDSchubert, CParks, DJCalvo, RRLaFrance, LVLattanze, JMilkiewicz, KLLu, T Substituted 1,4-benzodiazepine-2,5-diones as alpha-helix mimetic antagonists of the HDM2-p53 protein-protein interaction. Chem Biol Drug Des67:201-5 (2006) 
 
p53 binding protein
Name:p53 binding protein
Type:Protein
Mol. Mass.:10726.49
Organism:Homo sapiens (Human)
Description:Q9H4C2
Residue:98
BDBM81632
NameBDBM81632
Synonyms:BZD Scaffold, 2
TypeSmall organic molecule
Emp. Form.C26H21Cl2N2O4
Mol. Mass.496.362
SMILESCC(C)c1ccc2NC(=O)C(N(C(C([O-])=O)c3ccc(Cl)cc3)C(=O)c2c1)c1ccc(Cl)cc1