Reaction Details
Targetp53 binding protein
LigandBDBM81636
Substrate/Competitorn/a
Meas. Tech.HDM2 Binding Assay
IC50 4e+2±n/a nM
Citation Cummings, MDSchubert, CParks, DJCalvo, RRLaFrance, LVLattanze, JMilkiewicz, KLLu, T Substituted 1,4-benzodiazepine-2,5-diones as alpha-helix mimetic antagonists of the HDM2-p53 protein-protein interaction. Chem Biol Drug Des67:201-5 (2006) 
 
p53 binding protein
Name:p53 binding protein
Type:Protein
Mol. Mass.:10726.49
Organism:Homo sapiens (Human)
Description:Q9H4C2
Residue:98
BDBM81636
NameBDBM81636
Synonyms:BZD Scaffold, 6
TypeSmall organic molecule
Emp. Form.C23H14Cl2IN2O4
Mol. Mass.580.179
SMILES[O-]C(=O)C(N1C(c2ccc(Cl)cc2)C(=O)Nc2ccc(I)cc2C1=O)c1ccc(Cl)cc1