Reaction Details
TargetCoagulation factor X
LigandBDBM81696
Substrate/Competitorn/a
Meas. Tech.Inhibition Assay
IC50 5.0±0.0 nM
Citation Van Huis, CABigge, CFCasimiro-Garcia, ACody, WLDudley, DAFilipski, KJHeemstra, RJKohrt, JTNarasimhan, LSSchaum, RPZhang, EBryant, JWHaarer, SJaniczek, NLeadley, RJMcClanahan, TThomas Peterson, JWelch, KMEdmunds, JJ Structure-based drug design of pyrrolidine-1, 2-dicarboxamides as a novel series of orally bioavailable factor Xa inhibitors. Chem Biol Drug Des69:444-50 (2007) 
 
Coagulation factor X
Name:Coagulation factor X
Type:Enzyme
Mol. Mass.:54726.60
Organism:Homo sapiens (Human)
Description:n/a
Residue:488
BDBM81696
NameBDBM81696
Synonyms:4-Substituted Pyrrolidine Ring, 21
TypeSmall organic molecule
Emp. Form.C25H21ClF3N3O4S
Mol. Mass.551.965
SMILESCS(=O)(=O)c1ccccc1-c1ccc(NC(=O)[C@H]2CC(F)(F)CN2C(=O)Nc2ccc(Cl)cc2)c(F)c1