Reaction Details
TargetHeat shock protein HSP 90-alpha
LigandBDBM81729
Substrate/Competitorn/a
Meas. Tech.FRET Assay
pH7.5±0
Temperature298.15±0 K
Ki 3.2e+2±n/a nM
Citation Huth, JRPark, CPetros, AMKunzer, ARWendt, MDWang, XLynch, CLMack, JCSwift, KMJudge, RAChen, JRichardson, PLJin, STahir, SKMatayoshi, EDDorwin, SALadror, USSeverin, JMWalter, KABartley, DMFesik, SWElmore, SWHajduk, PJ Discovery and design of novel HSP90 inhibitors using multiple fragment-based design strategies. Chem Biol Drug Des70:1-12 (2007) 
 
Heat shock protein HSP 90-alpha
Name:Heat shock protein HSP 90-alpha
Type:Molecular Chaperone
Mol. Mass.:84623.45
Organism:Homo sapiens (Human)
Description:P07900
Residue:732
BDBM81729
NameBDBM81729
Synonyms:HSP90 Inhibitor, 1 | hsp90_125
TypeSmall organic molecule
Emp. Form.C13H10BrN5
Mol. Mass.316.156
SMILESNc1nc(N)nc(n1)-c1cc2ccccc2cc1Br