Reaction Details
TargetTyrosine-protein kinase ABL1 [T315I]
LigandBDBM13216
Substrate/Competitorn/a
Meas. Tech.Kinase Assay
pH7.4±0
Temperature298.15±0 K
IC50>3.0e+4±n/a nM
Citation Zhou, TParillon, LLi, FWang, YKeats, JLamore, SXu, QShakespeare, WDalgarno, DZhu, X Crystal structure of the T315I mutant of AbI kinase. Chem Biol Drug Des70:171-81 (2007) 
 
Tyrosine-protein kinase ABL1 [T315I]
Name:Tyrosine-protein kinase ABL1 [T315I]
Type:n/a
Mol. Mass.:122909.35
Organism:Homo sapiens (Human)
Description:P00519 (T315I)
Residue:1130
BDBM13216
NameBDBM13216
Synonyms:BMS-354825 DASATINIB N-(2-chloro-6-methylphenyl)-2-({6-[4-(2-hydroxyethyl)piperazin-1-yl]-2-methylpyrimidin-4-yl}amino)-1,3-thiazole-5-carboxamide US20230348453, Compound A8 med.21724, Compound Dasatinib
TypeSmall organic molecule
Emp. Form.C22H26ClN7O2S
Mol. Mass.488.006
SMILESCc1nc(Nc2ncc(s2)C(=O)Nc2c(C)cccc2Cl)cc(n1)N1CCN(CCO)CC1