Reaction Details
TargetMuscarinic acetylcholine receptor M3
LigandBDBM50040241
Substrate/Competitorn/a
Ki 41±n/a nM
CommentsPDSP_836
Citation Bolden, CCusack, BRichelson, E Antagonism by antimuscarinic and neuroleptic compounds at the five cloned human muscarinic cholinergic receptors expressed in Chinese hamster ovary cells. J Pharmacol Exp Ther260:576-80 (1992) Muscarinic acetylcholine receptor M3
Name:Muscarinic acetylcholine receptor M3
Type:Enzyme
Mol. Mass.:66151.03
Organism:Homo sapiens (Human)
Description:P20309
Residue:590
BDBM50040241
NameBDBM50040241
Synonyms:3-Fluoro-6-(4-methyl-piperazin-1-yl)-11H-dibenzo[b,e]azepine CHEMBL63756 | Fluperlapine
TypeSmall organic molecule
Emp. Form.C19H20FN3
Mol. Mass.309.3806
SMILESCN1CCN(CC1)C1=Nc2cc(F)ccc2Cc2ccccc12