Reaction Details
TargetMuscarinic acetylcholine receptor M5
LigandBDBM22869
Substrate/Competitorn/a
Ki 11.2±n/a nM
CommentsPDSP_552
Citation Bolden, CCusack, BRichelson, E Antagonism by antimuscarinic and neuroleptic compounds at the five cloned human muscarinic cholinergic receptors expressed in Chinese hamster ovary cells. J Pharmacol Exp Ther260:576-80 (1992) Muscarinic acetylcholine receptor M5
Name:Muscarinic acetylcholine receptor M5
Type:PROTEIN
Mol. Mass.:60102.35
Organism:Homo sapiens (Human)
Description:ChEMBL_1517990
Residue:532
BDBM22869
NameBDBM22869
Synonyms:6-chloro-10-(4-methylpiperazin-1-yl)-2,9-diazatricyclo[9.4.0.0^{3,8}]pentadeca-1,3(8),4,6,10,12,14-heptaene Clozapine US10259786, Clozapine
TypeSmall organic molecule
Emp. Form.C18H19ClN4
Mol. Mass.326.823
SMILESCN1CCN(CC1)C1=c2ccccc2=Nc2ccc(Cl)cc2N1