Reaction Details
TargetMuscarinic acetylcholine receptor M5
LigandBDBM81462
Substrate/Competitorn/a
Ki 15.9±n/a nM
CommentsPDSP_2044
Citation Bolden, CCusack, BRichelson, E Antagonism by antimuscarinic and neuroleptic compounds at the five cloned human muscarinic cholinergic receptors expressed in Chinese hamster ovary cells. J Pharmacol Exp Ther260:576-80 (1992) Muscarinic acetylcholine receptor M5
Name:Muscarinic acetylcholine receptor M5
Type:PROTEIN
Mol. Mass.:60102.35
Organism:Homo sapiens (Human)
Description:ChEMBL_1517990
Residue:532
BDBM81462
NameBDBM81462
Synonyms:(R)-Trihexyphenidyl Benzhexol NSC_5572 Trihexyphenidyl
TypeSmall organic molecule
Emp. Form.C20H31NO
Mol. Mass.301.4662
SMILESOC(CCN1CCCCC1)(C1CCCCC1)c1ccccc1