Reaction Details
TargetMuscarinic acetylcholine receptor M5
LigandBDBM35255
Substrate/Competitorn/a
Ki 260±n/a nM
CommentsPDSP_2002
Citation Bolden, CCusack, BRichelson, E Antagonism by antimuscarinic and neuroleptic compounds at the five cloned human muscarinic cholinergic receptors expressed in Chinese hamster ovary cells. J Pharmacol Exp Ther260:576-80 (1992) Muscarinic acetylcholine receptor M5
Name:Muscarinic acetylcholine receptor M5
Type:PROTEIN
Mol. Mass.:60102.35
Organism:Homo sapiens (Human)
Description:ChEMBL_1517990
Residue:532
BDBM35255
NameBDBM35255
Synonyms:2-Chlor-11-(2-dimethylaminoaethoxy)-dibenzo(b,f)-thiepin 2-[(8-chlorodibenzo[b,f]thiepin-10-yl)oxy]-N,N-dimethylethanamine Nipolept zotepine
TypeSmall organic molecule
Emp. Form.C18H18ClNOS
Mol. Mass.331.86
SMILESCN(C)CCOC1=Cc2ccccc2Sc2ccc(Cl)cc12