Reaction Details
Target5-hydroxytryptamine receptor 2A
LigandBDBM81769
Substrate/Competitorn/a
Ki 0.79±n/a nM
CommentsPDSP_1597
Citation Roth, BLCiaranello, RDMeltzer, HY Binding of typical and atypical antipsychotic agents to transiently expressed 5-HT1C receptors. J Pharmacol Exp Ther260:1361-5 (1992) 5-hydroxytryptamine receptor 2A
Name:5-hydroxytryptamine receptor 2A
Type:G Protein-Coupled Receptor (GPCR)
Mol. Mass.:52852.05
Organism:Rattus norvegicus (rat)
Description:Rat cortex membranes 5-HT2A receptors.
Residue:471
BDBM81769
NameBDBM81769
Synonyms:CAS_79781-95-6 RILAPINE
TypeSmall organic molecule
Emp. Form.C22H20ClN3
Mol. Mass.361.867
SMILESCN1CCN(CC1)C1=Cc2cc(Cl)ccc2C(=CC#N)c2ccccc12