Reaction Details
Target5-hydroxytryptamine receptor 2A
LigandBDBM21397
Substrate/Competitorn/a
Ki 0.4±n/a nM
CommentsPDSP_1739
Citation Roth, BLCiaranello, RDMeltzer, HY Binding of typical and atypical antipsychotic agents to transiently expressed 5-HT1C receptors. J Pharmacol Exp Ther260:1361-5 (1992) 5-hydroxytryptamine receptor 2A
Name:5-hydroxytryptamine receptor 2A
Type:G Protein-Coupled Receptor (GPCR)
Mol. Mass.:52852.05
Organism:Rattus norvegicus (rat)
Description:Rat cortex membranes 5-HT2A receptors.
Residue:471
BDBM21397
NameBDBM21397
Synonyms:8-[4-(4-fluorophenyl)-4-keto-butyl]-1-phenyl-1,3,8-triazaspiro[4.5]decan-4-one 8-[4-(4-fluorophenyl)-4-oxobutyl]-1-phenyl-1,3,8-triazaspiro[4.5]decan-4-one MLS000028615 SPIPERONE US9359372, Spiperone cid_5265
Typeradiolabeled ligand
Emp. Form.C23H26FN3O2
Mol. Mass.395.4698
SMILESFc1ccc(cc1)C(=O)CCCN1CCC2(CC1)N(CNC2=O)c1ccccc1