Reaction Details
Target5-hydroxytryptamine receptor 2A
LigandBDBM81770
Substrate/Competitorn/a
Ki 39.8±n/a nM
CommentsPDSP_1797
Citation Roth, BLCiaranello, RDMeltzer, HY Binding of typical and atypical antipsychotic agents to transiently expressed 5-HT1C receptors. J Pharmacol Exp Ther260:1361-5 (1992) 5-hydroxytryptamine receptor 2A
Name:5-hydroxytryptamine receptor 2A
Type:G Protein-Coupled Receptor (GPCR)
Mol. Mass.:52852.05
Organism:Rattus norvegicus (rat)
Description:Rat cortex membranes 5-HT2A receptors.
Residue:471
BDBM81770
NameBDBM81770
Synonyms:CAS_82650-83-7 TENILAPINE
TypeSmall organic molecule
Emp. Form.C17H16N4S2
Mol. Mass.340.466
SMILESCN1CCN(CC1)C1=Nc2cscc2C(=CC#N)c2cscc12