Reaction Details
TargetChloride channel protein 1
LigandBDBM50010685
Substrate/Competitorn/a
Ki>10000±n/a nM
CommentsPDSP_664
Citation Mottola, DMBrewster, WKCook, LLNichols, DEMailman, RB Dihydrexidine, a novel full efficacy D1 dopamine receptor agonist. J Pharmacol Exp Ther262:383-93 (1992) Chloride channel protein 1
Name:Chloride channel protein 1
Type:Enzyme Catalytic Domain
Mol. Mass.:110067.65
Organism:RAT
Description:P35524
Residue:994
BDBM50010685
NameBDBM50010685
Synonyms:(+/-)-trans-10,11-dihydroxy-5,6,6a,7,8,12b-hexahydrobenzo[a]phenanthridine 5,6,6a,7,8,12b-Hexahydro-benzo[a]phenanthridine-10,11-diol Dihydrexidine, DHX
TypeSmall organic molecule
Emp. Form.C17H17NO2
Mol. Mass.267.3224
SMILESOc1cc2CC[C@H]3NCc4ccccc4[C@H]3c2cc1O