Reaction Details
TargetAlpha-2A adrenergic receptor
LigandBDBM31046
Substrate/Competitorn/a
Ki 4.22±n/a nM
CommentsPDSP_1479
Citation Bylund, DBBlaxall, HSIversen, LJCaron, MGLefkowitz, RJLomasney, JW Pharmacological characteristics of alpha 2-adrenergic receptors: comparison of pharmacologically defined subtypes with subtypes identified by molecular cloning. Mol Pharmacol42:1-5 (1992) Alpha-2A adrenergic receptor
Name:Alpha-2A adrenergic receptor
Type:Enzyme
Mol. Mass.:48979.91
Organism:Homo sapiens (Human)
Description:P08913
Residue:450
BDBM31046
NameBDBM31046
Synonyms:3-[4,5-dihydro-1H-imidazol-2-ylmethyl-(4-methylphenyl)amino]phenol;methanesulfonic acid 3-[N-(2-imidazolin-2-ylmethyl)-4-methyl-anilino]phenol;mesylic acid MLS000069487 PHENTOLAMINE MESYLATE cid_5775 | cid_91430
TypeSmall organic molecule
Emp. Form.C17H19N3O
Mol. Mass.281.3523
SMILESCc1ccc(cc1)N(CC1=NCCN1)c1cccc(O)c1