Reaction Details
TargetAlpha-2B adrenergic receptor
LigandBDBM50020192
Substrate/Competitorn/a
Ki 0.29±n/a nM
CommentsPDSP_1743
Citation Bylund, DBBlaxall, HSIversen, LJCaron, MGLefkowitz, RJLomasney, JW Pharmacological characteristics of alpha 2-adrenergic receptors: comparison of pharmacologically defined subtypes with subtypes identified by molecular cloning. Mol Pharmacol42:1-5 (1992) Alpha-2B adrenergic receptor
Name:Alpha-2B adrenergic receptor
Type:Enzyme Catalytic Domain
Mol. Mass.:50379.83
Organism:NEONATAL RAT
Description:adrenergic Alpha2B ADRA2B NEONATAL RAT::P19328
Residue:453
BDBM50020192
NameBDBM50020192
Synonyms:8-(2,3-Dihydro-benzo[1,4]dioxin-2-ylmethyl)-1-phenyl-1,3,8-triaza-spiro[4.5]decan-4-one Spiroxatrine
TypeSmall organic molecule
Emp. Form.C22H25N3O3
Mol. Mass.379.4522
SMILESO=C1NCN(c2ccccc2)C11CCN(CC2COc3ccccc3O2)CC1