Reaction Details
TargetAlpha-2C adrenergic receptor
LigandBDBM81773
Substrate/Competitorn/a
Ki 0.39±n/a nM
CommentsPDSP_340
Citation Bylund, DBBlaxall, HSIversen, LJCaron, MGLefkowitz, RJLomasney, JW Pharmacological characteristics of alpha 2-adrenergic receptors: comparison of pharmacologically defined subtypes with subtypes identified by molecular cloning. Mol Pharmacol42:1-5 (1992) Alpha-2C adrenergic receptor
Name:Alpha-2C adrenergic receptor
Type:Enzyme
Mol. Mass.:49552.32
Organism:Homo sapiens (Human)
Description:P18825
Residue:462
BDBM81773
NameBDBM81773
Synonyms:BAM 1303 CAS_115219-10-8
TypeSmall organic molecule
Emp. Form.C25H25BrN4
Mol. Mass.461.397
SMILESCN1C[C@H](Cn2ccnc2-c2ccccc2)C[C@H]2[C@H]1Cc1c(Br)[nH]c3cccc2c13