Reaction Details
TargetAlpha-2C adrenergic receptor
LigandBDBM50020192
Substrate/Competitorn/a
Ki 0.13±n/a nM
CommentsPDSP_1743
Citation Bylund, DBBlaxall, HSIversen, LJCaron, MGLefkowitz, RJLomasney, JW Pharmacological characteristics of alpha 2-adrenergic receptors: comparison of pharmacologically defined subtypes with subtypes identified by molecular cloning. Mol Pharmacol42:1-5 (1992) Alpha-2C adrenergic receptor
Name:Alpha-2C adrenergic receptor
Type:Enzyme
Mol. Mass.:49552.32
Organism:Homo sapiens (Human)
Description:P18825
Residue:462
BDBM50020192
NameBDBM50020192
Synonyms:8-(2,3-Dihydro-benzo[1,4]dioxin-2-ylmethyl)-1-phenyl-1,3,8-triaza-spiro[4.5]decan-4-one Spiroxatrine
TypeSmall organic molecule
Emp. Form.C22H25N3O3
Mol. Mass.379.4522
SMILESO=C1NCN(c2ccccc2)C11CCN(CC2COc3ccccc3O2)CC1