Reaction Details
TargetSomatostatin receptor type 4
LigandBDBM50254239
Substrate/Competitorn/a
Ki 0.08±n/a nM
CommentsPDSP_1763
Citation O'Carroll, AMLolait, SJKönig, MMahan, LC Molecular cloning and expression of a pituitary somatostatin receptor with preferential affinity for somatostatin-28. Mol Pharmacol42:939-46 (1992) Somatostatin receptor type 4
Name:Somatostatin receptor type 4
Type:Enzyme Catalytic Domain
Mol. Mass.:42096.84
Organism:RAT
Description:SOMATOSTATIN SST4 SSTR4 RAT::P30937
Residue:384
BDBM50254239
NameBDBM50254239
Synonyms:somatostatin-28
TypeSmall organic molecule
Emp. Form.C137H207N41O39S3
Mol. Mass.3148.556
SMILESCSCC[C@H](NC(=O)[C@H](C)NC(=O)[C@@H]1CCCN1C(=O)[C@H](CC(N)=O)NC(=O)[C@H](CO)NC(=O)[C@H](CC(N)=O)NC(=O)[C@H](C)NC(=O)[C@@H](N)CO)C(=O)N[C@@H](C)C(=O)N1CCC[C@H]1C(=O)N[C@@H](CCCN=C(N)N)C(=O)N[C@@H](CCC(O)=O)C(=O)N[C@@H](CCCN=C(N)N)C(=O)N[C@@H](CCCCN)C(=O)N[C@@H](C)C(=O)NCC(=O)N[C@H]1CSSC[C@H](NC(=O)[C@H](CO)NC(=O)[C@@H](NC(=O)[C@H](Cc2ccccc2)NC(=O)[C@@H](NC(=O)[C@H](CCCCN)NC(=O)[C@H](Cc2c[nH]c3ccccc23)NC(=O)[C@H](Cc2ccccc2)NC(=O)[C@H](Cc2ccccc2)NC(=O)[C@H](CC(N)=O)NC(=O)[C@H](CCCCN)NC1=O)[C@@H](C)O)[C@@H](C)O)C(O)=O