Reaction Details
Target5-hydroxytryptamine receptor 5A
LigandBDBM25761
Substrate/Competitorn/a
Ki>10000±n/a nM
CommentsPDSP_1540
Citation Plassat, JLBoschert, UAmlaiky, NHen, R The mouse 5HT5 receptor reveals a remarkable heterogeneity within the 5HT1D receptor family. EMBO J11:4779-86 (1992) 5-hydroxytryptamine receptor 5A
Name:5-hydroxytryptamine receptor 5A
Type:Enzyme Catalytic Domain
Mol. Mass.:40749.33
Organism:MOUSE
Description:5-HT5 0 MOUSE::P30966
Residue:357
BDBM25761
NameBDBM25761
Synonyms:Anapriline CHEMBL27 PROPRANOLOL, d PROPRANOLOL,(+) Propanolol Propranolol | [2-hydroxy-3-(naphthalen-1-yloxy)propyl](propan-2-yl)amine
TypeSmall organic molecule
Emp. Form.C16H21NO2
Mol. Mass.259.3434
SMILESCC(C)NCC(O)COc1cccc2ccccc12